moteur à ressort
created: 2012-05-16T00:00:00+02:00
modified: 2015-08-06T11:33:55+02:00
status: 1
type: Concept
broader: T69-6106
definition: Moteur à énergie mécanique utilisant l'énergie accumulée par un ressort comprimé.
in scheme: T69