turbine hydraulique
created: 2012-05-16T00:00:00+02:00
modified: 2015-08-06T12:38:44+02:00
status: 1
type: Concept
broader: T69-6128
definition: Moteur hydraulique, le plus souvent immergé, à grande vitesse de rotation, constitué d'une partie fixe, le distributeur, et d'une partie mobile, roue à pales, à augets ou hélice.
in scheme: T69