moteur électrique
created: 2012-05-16T00:00:00+02:00
modified: 2015-08-06T16:20:22+02:00
status: 1
type: Concept
broader: T69-6104
definition: Moteur dont la source énergétique motrice est électrique.
in scheme: T69
narrower: T69-6152
narrower: T69-6158