moteur électrique alternatif
created: 2012-05-16T00:00:00+02:00
modified: 2015-10-07T17:50:22+02:00
status: 1
type: Concept
broad match: Machine électrique
broader: T69-6150
definition: Moteur utilisant une source d'énergie électrique alternative.
in scheme: T69
narrower: T69-6154
narrower: T69-6156