moteur électrique alternatif triphasé
created: 2012-05-16T00:00:00+02:00
modified: 2015-10-07T17:52:04+02:00
status: 1
type: Concept
broad match: http://data.bnf.fr/ark:/12148/cb119445001
broader: T69-6152
definition: Moteur électrique utilisant une source d'énergie électrique alternative, à trois phases.
in scheme: T69