moteur électrique continu
created: 2012-05-16T00:00:00+02:00
modified: 2015-10-07T17:55:30+02:00
status: 1
type: Concept
broader: T69-6150
definition: Moteur électrique utilisant une source d'énergie électrique continue.
in scheme: T69