moteur à pistons à explosion
created: 2012-05-16T00:00:00+02:00
modified: 2015-08-10T12:09:11+02:00
status: 1
type: Concept
alternative label: moteur à essence
broader: T69-6180
definition: Moteur thermique à combustion interne dont la production cyclique de gaz chauds est provoquée par un arc électrique contrôlé.
in scheme: T69