moteur à turbine à combustion
created: 2012-05-16T00:00:00+02:00
modified: 2015-10-07T18:21:05+02:00
status: 1
type: Concept
alternative label: moteur-fusée
alternative label: turbine d'entraînement
alternative label: turbine de propulsion
alternative label: turboréacteur
broader: T69-6180
definition: Moteur thermique à combustion interne dont la production de gaz chauds est continue.
in scheme: T69
narrow match: Turboréacteur