système de transmission
created: 2012-05-16T00:00:00+02:00
modified: 2015-10-08T10:53:52+02:00
status: 1
type: Concept
broader: T69-6028
definition: Ensemble d'organes servant à transmettre la force mécanique de production par le biais d'arbres de transmission, d'engrenage, de poulies, de courroies, de chaînes, etc.
in scheme: T69