équipement portuaire flottant
created: 2012-05-16T00:00:00+02:00
modified: 2014-10-16T10:51:06+02:00
status: 1
type: Concept
broad match: cb15888847p
broad match: Port
broad match: http://vocab.getty.edu/aat/300007967
broader: T69-6326
definition: Matériel flottant réservé à l'activité portuaire.
in scheme: T69
narrower: T69-6300
narrower: T69-6335
narrower: T69-6337