équipement collectif flottant
created: 2012-05-16T00:00:00+02:00
modified: 2014-12-19T16:31:26+01:00
status: 1
type: Concept
alternative label: bain flottant
alternative label: bateau piscine
alternative label: bateau-lavoir
alternative label: équipement public flottant
broad match: http://vocab.getty.edu/aat/300007967
broader: T69-6326
definition: Installation flottante fixe, de fonction variée, à la disposition du public.
in scheme: T69
narrow match: http://data.bnf.fr/ark:/12148/cb12127807b