embarcation de sauvetage
created: 2012-05-16T00:00:00+02:00
modified: 2014-12-19T16:26:08+01:00
status: 1
type: Concept
alternative label: canot de sauvetage
alternative label: drome de sauvetage
alternative label: radeau de sauvetage
broader: T69-6353
definition: Embarcation installée réglementairement sur les bateaux pour la sauvegarde des passagers et de l'équipage. Si c'est un radeau, il peut être gonflable.
in scheme: T69
scope note: Ne pas confondre avec bateau de sauvetage.