équipement de survie maritime
created: 2012-05-16T00:00:00+02:00
modified: 2014-12-19T16:41:07+01:00
status: 1
type: Concept
alternative label: bateau de survie
alternative label: bouée de sauvetage
alternative label: brassière de sauvetage
alternative label: gilet de sauvetage
broader: T69-6353
definition: Equipement individuel destiné à faciliter la survie en cas de naufrage ou de chute à la mer.
in scheme: T69
narrow match: cb16565533n
preferred label: life preservers @en-us