matériel d'exploration sous-marin
created: 2012-05-16T00:00:00+02:00
modified: 2014-12-19T16:28:30+01:00
status: 1
type: Concept
alternative label: cloche à plongeur
alternative label: scaphandre
broader: T69-6353
definition: Equipement embarqué, non auto propulsé, destiné à l'exploration des fonds marins.
in scheme: T69
narrow match: cb11946955w
narrow match: Scaphandre