poupée
created: 2012-05-16T00:00:00+02:00
modified: 2014-12-30T13:14:36+01:00
status: 1
type: Concept
broader: T69-9437
definition: Reproduction réduite d'une personne (un bébé, un enfant ou un adulte) destinée à l'amusement des enfants ou à la décoration.
in scheme: T69
preferred label: dolls @en-us