retable
terme associe: T69-4851
terme associe: T69-4889
terme associe: T69-683
created: 2012-05-16T00:00:00+02:00
modified: 2014-12-01T14:16:06+01:00
status: 1
type: Concept
broader: T69-578
definition: Structure comportant une ou plusieurs représentations religieuses figurées, généralement peintes ou sculptées, placées dans un cadre, à l'arrière de la table d'autel ou derrière l'autel. Le retable est très souvent architecturé avec des colonnes, des architraves, etc. Il peut s'agir d'un polyptyque. Une prédelle, un tableau d'autel ou une lunette d’autel peuvent faire partie ou être des éléments démembrés d'un retable.
in scheme: T69
preferred label: reredoses (screens) @en-us
preferred label: mostra d'altare @it
preferred label: retábulo @pt
related: T69-4851
related: T69-4889
related: T69-683