tableau d'autel
terme associe: T69-4851
created: 2012-05-16T00:00:00+02:00
modified: 2014-12-01T14:23:01+01:00
status: 1
type: Concept
broader: T69-578
definition: Figuration religieuse peinte ou en relief, posée sur un autel ou derrière celui-ci, sur un mur, généralement dans un cadre ou dans un retable. Une lunette d’autel ou une prédelle peut faire partie ou être un élément démembré d'un tableau d'autel.
in scheme: T69
preferred label: altarpieces @en-us
preferred label: pala d'altare @it
preferred label: quadro de altar @pt
related: T69-4851