costume civil, professionnel ou militaire
terme associe: T69-9459
created: 2012-05-16T00:00:00+02:00
modified: 2014-10-17T16:41:29+02:00
status: 1
type: Concept
broader: T69-6546
definition: Ensemble des pièces servant à couvrir ou protéger le corps humain à l'exclusion des vêtements religieux. Les principales pièces du costume sont des vêtements en tissu, d'autres (le chaussage, la ganterie, etc.) peuvent être en cuir et quelques accessoires en métal, écaille, bois, etc.
in scheme: T69
narrower: T69-6462
narrower: T69-6471
narrower: T69-6496
narrower: T69-6499
narrower: T69-6507
narrower: T69-6510
narrower: T69-6512
narrower: T69-6527
narrower: T69-9166
narrower: T69-9226
narrower: T69-9307
narrower: T69-9312
narrower: T69-9317
related: T69-9459