vêtement d'extérieur
created: 2012-05-16T00:00:00+02:00
modified: 2014-10-20T10:41:13+02:00
status: 1
type: Concept
broad match: cb11963612g
broader: T69-6461
definition: Vêtement qui se porte exclusivement à l'extérieur de la maison, essentiellement dehors ou dans certains lieux abrités.
in scheme: T69
narrower: T69-6463
narrower: T69-6465
narrower: T69-9230
preferred label: outerwear @en-us