châle
created: 2012-05-16T00:00:00+02:00
modified: 2014-12-11T16:17:51+01:00
status: 1
type: Concept
broader: T69-6462
definition: Pièce d'étoffe carrée ou triangulaire que les femmes portent, par dessus leurs vêtements, sur leurs épaules et en la croisant sur la poitrine.
in scheme: T69
preferred label: shawls @en-us