manteau
created: 2012-05-16T00:00:00+02:00
modified: 2014-12-11T16:25:36+01:00
status: 1
type: Concept
alternative label: dolman
alternative label: pardessus
alternative label: poncho
broader: T69-6462
definition: Vêtement ample, le plus souvent long, qui se porte au-dessus des autres vêtements et est généralement destiné à envelopper tout le corps afin de le protéger du froid ou des intempéries.
in scheme: T69
narrower: T69-6467
preferred label: mantles (outerwear) @en-us