meuble lié à l'Eucharistie
created: 2012-05-16T00:00:00+02:00
modified: 2014-12-01T16:22:41+01:00
status: 1
type: Concept
broader: T69-577
definition: Mobilier lié au sacrement de l’Eucharistie (sacrement contenant le corps, le sang et la divinité du Christ au terme de la transsubstantiation du pain et du vin).
in scheme: T69
narrower: T69-649
narrower: T69-652
narrower: T69-659
narrower: T69-661
narrower: T69-664
narrower: T69-666
narrower: T69-668
narrower: T69-673
narrower: T69-679
narrower: T69-681
narrower: T69-683
narrower: T69-9084
preferred label: furniture and furnishings for the Eucharist @en-us
preferred label: arredi per l'Eucaristia @it
preferred label: mobiliário relacionado com a eucaristica @pt