cravate
created: 2012-05-16T00:00:00+02:00
modified: 2014-12-11T16:38:20+01:00
status: 1
type: Concept
alternative label: nœud papillon
broader: T69-6471
definition: Bande d'étoffe passée autour du col ou sous le col de la chemise, nouée par-devant et dont les deux pans verticaux pendent sur la poitrine.
in scheme: T69
preferred label: neckties @en-us