gilet
created: 2012-05-16T00:00:00+02:00
modified: 2014-12-11T16:40:33+01:00
status: 1
type: Concept
alternative label: boléro
broader: T69-6471
definition: Sorte de veste courte et serrée à la taille, le plus souvent sans manches, qui se porte sur la chemise et sous la veste pour l'homme et sur le corsage ou la robe pour la femme.
in scheme: T69
preferred label: waistcoats (garments) @en-us