jupe
created: 2012-05-16T00:00:00+02:00
modified: 2014-12-11T16:43:03+01:00
status: 1
type: Concept
broader: T69-6471
definition: Vêtement, principalement féminin, qui enserre la taille et descend plus ou moins bas, couvrant tout ou une partie du bas du corps sans division pour chaque jambe.
in scheme: T69
preferred label: skirts (garments) @en-us