pantalon
created: 2012-05-16T00:00:00+02:00
modified: 2014-12-11T16:45:05+01:00
status: 1
type: Concept
alternative label: culotte
broader: T69-6471
definition: Vêtement porté sur la partie inférieure du corps, les deux jambes étant couvertes séparément.
in scheme: T69
preferred label: trousers @en-us