robe
created: 2012-05-16T00:00:00+02:00
modified: 2014-12-11T16:46:20+01:00
status: 1
type: Concept
broader: T69-6471
definition: Vêtement essentiellement féminin, d'un seul tenant, généralement pourvu de manches, descendant jusqu'aux genoux ou jusqu'aux pieds avec une forme et une ampleur variable.
in scheme: T69
preferred label: dresses (garments) @en-us