veste
created: 2012-05-16T00:00:00+02:00
modified: 2014-12-11T16:50:11+01:00
status: 1
type: Concept
alternative label: frac
alternative label: habit
alternative label: redingote
alternative label: veston
broader: T69-6471
definition: Vêtement à manches longues couvrant la partie supérieure du corps qui s'ouvre sur le devant et ne descend pas plus bas que les hanches. La veste se porte sur la chemise ou le corsage et sous le manteau, en hiver.
in scheme: T69
preferred label: jackets @en-us