vêtement de nuit ou d'intérieur
created: 2012-05-16T00:00:00+02:00
modified: 2014-12-11T16:56:47+01:00
status: 1
type: Concept
alternative label: chemise de nuit
alternative label: peignoir
alternative label: pyjama
alternative label: robe de chambre
broader: T69-6461
definition: Vêtement qui se porte pour dormir ou exclusivement à l'intérieur de la maison.
in scheme: T69
preferred label: night and dressing wear @en-us