bas
created: 2012-05-16T00:00:00+02:00
modified: 2014-12-11T15:47:14+01:00
status: 1
type: Concept
alternative label: bande-moletière
alternative label: chaussette
alternative label: collant
broader: T69-6507
definition: Pièce textile s'enfilant sur la jambe et le pied pour les protéger. Elle se porte sur la peau et dans la chaussure.
in scheme: T69
preferred label: stockings @en-us