ganterie
created: 2012-05-16T00:00:00+02:00
modified: 2014-12-10T18:20:29+01:00
status: 1
type: Concept
alternative label: gant
alternative label: mitaine
alternative label: moufle
broader: T69-6461
definition: Pièce fait de peau ou d'étoffe qui épouse la forme de la main et des doigts et qui est utilisée comme accessoire de l'habillement ou comme protection dans diverses activités.
in scheme: T69
preferred label: handwear @en-us