armoire eucharistique
terme associe: T69-686
created: 2012-05-16T00:00:00+02:00
modified: 2014-12-01T16:28:19+01:00
status: 1
type: Concept
alternative label: repositoire
alternative label: sacraire
alternative label: tabernacle mural
broader: T69-648
definition: Petit placard mural servant à conserver la réserve eucharistique. Il est placé à côté du maître-autel et ferme à clef. C'est une des formes anciennes du tabernacle.
in scheme: T69
preferred label: aumbries @en-us
preferred label: tabernacolo murale @it
preferred label: armário eucarístico @pt
related: T69-686