chapeau ou coiffure
terme associe: T69-2518
created: 2012-05-16T00:00:00+02:00
modified: 2014-12-10T18:06:10+01:00
status: 1
type: Concept
alternative label: béret
alternative label: cagoule
alternative label: calot
alternative label: canotier
alternative label: capeline
alternative label: capuche
alternative label: casquette
alternative label: chapeau-melon
alternative label: couvre-chef
alternative label: haut-de-forme
alternative label: mouchoir-fichu
alternative label: perruque
alternative label: toque
alternative label: tricorne
alternative label: turban
broader: T69-6461
definition: Pièce du vêtement de forme extrêmement variée, destinée à couvrir la tête, le plus souvent pour sortir.
in scheme: T69
narrower: T69-6528
narrower: T69-6532
narrower: T69-6536
narrower: T69-6538
narrower: T69-6544
narrower: T69-9306
preferred label: headgear @en-us
related: T69-2518