bonnet
created: 2012-05-16T00:00:00+02:00
modified: 2014-12-10T18:10:44+01:00
status: 1
type: Concept
broader: T69-6527
definition: Coiffure en matière souple et sans bord ni visière.
in scheme: T69
preferred label: caps (headgear) @en-us