bicorne
created: 2012-05-16T00:00:00+02:00
modified: 2014-12-10T18:08:08+01:00
status: 1
type: Concept
broad match: cb11935470z
broader: T69-6527
definition: Coiffure à deux pointes qui se porte perpendiculairement ou parallèlement à la ligne des épaules.
in scheme: T69
preferred label: bicornes @en-us