képi
created: 2012-05-16T00:00:00+02:00
modified: 2014-10-20T10:22:10+02:00
status: 1
type: Concept
broader: T69-6527
definition: Coiffure rigide ou semi-rigide en drap, de forme cylindrique, à fond plat et surélevé, munie d'une visière, portée en France par les officiers et sous-officiers de certaines armes, par certains fonctionnaires et employés et, anciennement, par les écoliers de certains établissements publics.
in scheme: T69
preferred label: kepis @en-us