mouchoir
created: 2012-05-16T00:00:00+02:00
modified: 2014-12-10T17:57:14+01:00
status: 1
type: Concept
alternative label: mouchoir d'instruction militaire
broader: T69-9317
definition: Petite pièce de linge ou de tissu de cellulose portée dans une poche ou dans son sac dont on se sert principalement pour se moucher, éventuellement pour s'essuyer.
in scheme: T69
preferred label: handkerchiefs @en-us