voilette
created: 2012-05-16T00:00:00+02:00
modified: 2014-10-20T10:23:10+02:00
status: 1
type: Concept
alternative label: mantille
broader: T69-6527
definition: Petit voile transparent, le plus souvent en tulle ou en dentelle, que les femmes portent en garniture au bord de leur chapeau et qui recouvre le visage en partie ou en totalité.
in scheme: T69
preferred label: hat veils @en-us