canne
created: 2012-05-16T00:00:00+02:00
modified: 2014-12-10T17:54:15+01:00
status: 1
type: Concept
broader: T69-9317
definition: Bâton léger, parfois ouvragé qui, tenu à la main, sert d'appui à une personne qui marche.
in scheme: T69
preferred label: walking sticks @en-us