fenestrelle de communion
created: 2012-05-16T00:00:00+02:00
modified: 2014-12-01T16:40:27+01:00
status: 1
type: Concept
broad match: http://data.bnf.fr/ark:/12148/cb119489917
broad match: Mobilier liturgique
broader: T69-648
definition: Petite ouverture fermée par un battant ou une grille à travers laquelle les religieuses cloîtrées reçoivent la communion. La fenestrelle de communion peut être décorée sur le pourtour, porter une inscription ou une iconographie relative au saint sacrement.
in scheme: T69
preferred label: communion windows @en-us
preferred label: finestrella per la somministrazione eucaristica @it
preferred label: janela de comunhão @pt