suspension eucharistique
terme associe: T69-1210
terme associe: T69-1231
created: 2012-05-16T00:00:00+02:00
modified: 2014-12-01T16:45:06+01:00
status: 1
type: Concept
alternative label: crosse eucharistique
alternative label: support de réserve eucharistique
alternative label: suspense eucharistique
broad match: http://data.bnf.fr/ark:/12148/cb119489917
broad match: Mobilier liturgique
broader: T69-648
definition: Support servant à maintenir suspendue au-dessus d’un autel la réserve eucharistique, directement ou par l'intermédiaire d'un tabernacle lui-même suspendu.
in scheme: T69
preferred label: hanging pyxes @en-us
preferred label: dispositivo di sospensione eucaristica @it
preferred label: suspensão eucarística @pt
related: T69-1210
related: T69-1231