garde-corps de fenêtre
created: 2012-06-07T00:00:00+02:00
modified: 2015-01-30T12:52:26+01:00
status: 1
type: Concept
alternative label: appui de fenêtre
broader: T69-132
definition: Ouvrage à hauteur d'appui formant protection devant une fenêtre.
in scheme: T69
preferred label: window railings @en-us