mobilier de jardin
created: 2012-06-11T00:00:00+02:00
modified: 2015-02-24T10:50:43+01:00
status: 1
type: Concept
alternative label: table de jardin
alternative label: éclairage de jardin
broader: T69-512
definition: Mobilier spécifiquement destiné aux espaces verts publics ou privés.
in scheme: T69
preferred label: garden furniture @en-us