siège de jardin
terme associe: T69-27
created: 2012-06-11T00:00:00+02:00
modified: 2015-02-24T10:52:29+01:00
status: 1
type: Concept
alternative label: banc de jardin
alternative label: chaise de jardin
alternative label: fauteuil de jardin
broader: T69-512
definition: Meuble de repos à une ou plusieurs places servant à s’asseoir dans un jardin. Le fond comporte généralement des parties évidées pour l’écoulement de l’eau de pluie.
in scheme: T69
preferred label: garden seats @en-us
related: T69-27