treillage
created: 2012-06-11T00:00:00+02:00
modified: 2015-02-24T10:56:07+01:00
status: 1
type: Concept
broader: T69-512
definition: Assemblage de lattes de bois ou de plastique, d’échalas, de barres de fer, posées parallèlement ou croisées formant des mailles de différentes tailles. Un treillage est généralement adossé à un support vertical ou plan. Il ne doit pas être confondu avec la fabrique de treillage, qui peut emprunter diverses formes architecturales.
in scheme: T69
preferred label: trellises @en-us