vase décoratif de jardin
created: 2012-06-11T00:00:00+02:00
modified: 2015-02-24T10:58:30+01:00
status: 1
type: Concept
broader: T69-512
definition: Vase décoratif comportant en général des parties sculptées et souvent posé sur un socle ou sur un piédestal et associé à une architecture de jardin. Il peut également servir de réceptacle à des plantes fleuries.
in scheme: T69