tabernacle
terme associe: T69-1210
terme associe: T69-1229
terme associe: T69-2225
created: 2012-05-16T00:00:00+02:00
modified: 2014-12-01T16:54:09+01:00
status: 1
type: Concept
alternative label: réserve eucharistique
alternative label: tabernacle-exposition
broader: T69-648
definition: Armoire plus ou moins développée, souvent de forme architecturale, fermant à clef, placée sur un autel et servant à conserver la réserve eucharistique.
in scheme: T69
narrower: T69-675
preferred label: tabernacles (liturgical containers) @en-us
preferred label: tabernacolo @it
preferred label: sacrário @pt
related: T69-1210
related: T69-1229
related: T69-2225