porte de tabernacle
created: 2012-05-16T00:00:00+02:00
modified: 2014-12-01T16:56:05+01:00
status: 1
type: Concept
broad match: http://data.bnf.fr/ark:/12148/cb121654992
broader: T69-673
definition: Vantail souvent orné d'une iconographie liée à l'Eucharistie.
in scheme: T69
preferred label: tabernacle doors @en-us
preferred label: sportello di tabernacolo @it
preferred label: porta de sacrário @pt