tabernacle suspendu
terme associe: T69-1210
terme associe: T69-1231
created: 2012-05-16T00:00:00+02:00
modified: 2014-12-01T16:57:24+01:00
status: 1
type: Concept
broad match: http://data.bnf.fr/ark:/12148/cb121654992
broad match: http://vocab.getty.edu/aat/300207778
broader: T69-648
definition: Réceptacle accroché à une suspension eucharistique et servant à contenir la réserve eucharistique.
in scheme: T69
preferred label: suspended tabernacles @en-us
preferred label: tabernacolo pensile @it
preferred label: tabernáculo suspenso @pt
related: T69-1210
related: T69-1231