tour eucharistique
terme associe: T69-640
created: 2012-05-16T00:00:00+02:00
modified: 2014-12-01T17:01:24+01:00
status: 1
type: Concept
broad match: http://data.bnf.fr/ark:/12148/cb119489917
broader: T69-648
definition: Armoire en forme de tour, placée près du maître-autel ou parfois posée au sommet d'un retable, et servant à conserver la réserve eucharistique et quelquefois les saintes huiles. C'est une des formes anciennes du tabernacle.
in scheme: T69
preferred label: sacrament towers @en-us
preferred label: edicola del Sacramento @it
preferred label: torre eucarística @pt
related: T69-640